BDBM483937 2-(4-Phenyl-1H-benzo[d]imidazol-2-yl)morpholine-4-carbonitrile::US10927110, Example 4
SMILES O=C(Nc1ccccc1-c1ccccc1)C1CN(CCO1)C#N
InChI Key InChIKey=FLHDDWNTUAOXMC-UHFFFAOYSA-N
Data  1 IC50
  Tab Delimited (TSV)   2D SDfile   Computed 3D by Vconf -m prep SDfile
Find this compound or compounds like it in BindingDB:
Activity Spreadsheet -- Enzyme Inhibition Constant Data from BindingDB
Found 1 hit for monomerid = 483937
TargetUbiquitin carboxyl-terminal hydrolase 30(Homo sapiens (Human))
Mission Therapeutics
US Patent
LigandPNGBDBM483937(2-(4-Phenyl-1H-benzo[d]imidazol-2-yl)morpholine-4-...)
Affinity DataIC50: >1.00E+4nM. Assay description: Dilution plates were prepared at 21 times the final concentration (2100 μM for a final concentration of 100 μM) in 50% DMSO in a 96-well po...
Ligand InfoPC cidPC sid
In DepthDetails US Patent