BDBM483953 3-(6-(3-cyanophenyl)-1H-imidazo[4,5-b]pyridin-2-yl)-3-fluoropiperidine-1-carbonitrile::US10927110, Example 20
SMILES FC1(CCCN(C1)C#N)c1nc2ccc(nc2[nH]1)-c1cccc(c1)C#N
InChI Key
Data  1 IC50
  Tab Delimited (TSV)   2D SDfile   Computed 3D by Vconf -m prep SDfile
Find this compound or compounds like it in BindingDB:
Activity Spreadsheet -- Enzyme Inhibition Constant Data from BindingDB
Found 1 hit for monomerid = 483953
TargetUbiquitin carboxyl-terminal hydrolase 30(Homo sapiens (Human))
Mission Therapeutics
US Patent
LigandPNGBDBM483953(3-(6-(3-cyanophenyl)-1H-imidazo[4,5-b]pyridin-2-yl...)
Affinity DataIC50:  550nM. Assay description: Dilution plates were prepared at 21 times the final concentration (2100 μM for a final concentration of 100 μM) in 50% DMSO in a 96-well po...
Ligand InfoPC cidPC sid
In DepthDetails US Patent