BDBM484013 N-(3-(2-(cyclopropanecarboxamido)- 7-methylpyrido[2,3-d]pyrimidin-6-yl)- 4-methylphenyl)-2- (trifluoromethyl)isonicotinamide::US10927111, Example 49::US11667634, Example 49
SMILES Cc1ccc(NC(=O)c2ccnc(c2)C(F)(F)F)cc1-c1cc2cnc(NC(=O)C3CC3)nc2nc1C
InChI Key InChIKey=PEOBUXPFDYIBKD-UHFFFAOYSA-N
Data  2 IC50
  Tab Delimited (TSV)   2D SDfile   Computed 3D by Vconf -m prep SDfile
Find this compound or compounds like it in BindingDB:
Activity Spreadsheet -- Enzyme Inhibition Constant Data from BindingDB
Found 2 hits for monomerid = 484013
TargetRAF proto-oncogene serine/threonine-protein kinase(Homo sapiens (Human))
Kinnate Biopharma
US Patent
LigandPNGBDBM484013(N-(3-(2-(cyclopropanecarboxamido)- 7-methylpyrido[...)
Affinity DataIC50: <0.100nM. Assay description: Protein kinase assay: Assay platform was used to measure kinase/inhibitor interactions as described previously (Anastassiadis et al., 2011). In brief...
Ligand InfoPC cidPC sid
In DepthDetails US Patent
TargetRAF proto-oncogene serine/threonine-protein kinase(Homo sapiens (Human))
Kinnate Biopharma
US Patent
LigandPNGBDBM484013(N-(3-(2-(cyclopropanecarboxamido)- 7-methylpyrido[...)
Affinity DataIC50: <10nM. Assay description: Protein kinase assay: Assay platform was used to measure kinase/inhibitor interactions as described previously (Anastassiadis et al., 2011). In brief...
Ligand InfoPC cidPC sid
In DepthDetails US Patent