BDBM484027 (3S)-N/-[6-methyl-5-[2- (methylamino)pyrido[2,3-d]pyrimidin- 6-yl]pyridin-3-yl]-3- (trifluoromethoxy)pyrrolidine-1- carboxamide::US10927111, Example 63::US11667634, Example 63
SMILES CNc1ncc2cc(cnc2n1)-c1cc(NC(=O)N2CC[C@@H](C2)OC(F)(F)F)cnc1C
InChI Key InChIKey=KEGNFTBOVOAISH-HNNXBMFYSA-N
Data  2 IC50
  Tab Delimited (TSV)   2D SDfile   Computed 3D by Vconf -m prep SDfile
Find this compound or compounds like it in BindingDB:
Activity Spreadsheet -- Enzyme Inhibition Constant Data from BindingDB
Found 2 hits for monomerid = 484027
TargetRAF proto-oncogene serine/threonine-protein kinase(Homo sapiens (Human))
Kinnate Biopharma
US Patent
LigandPNGBDBM484027((3S)-N/-[6-methyl-5-[2- (methylamino)pyrido[2,3-d]...)
Affinity DataIC50: <0.100nM. Assay description: Protein kinase assay: Assay platform was used to measure kinase/inhibitor interactions as described previously (Anastassiadis et al., 2011). In brief...
Ligand InfoPC cidPC sid
In DepthDetails US Patent
TargetRAF proto-oncogene serine/threonine-protein kinase(Homo sapiens (Human))
Kinnate Biopharma
US Patent
LigandPNGBDBM484027((3S)-N/-[6-methyl-5-[2- (methylamino)pyrido[2,3-d]...)
Affinity DataIC50: <10nM. Assay description: Protein kinase assay: Assay platform was used to measure kinase/inhibitor interactions as described previously (Anastassiadis et al., 2011). In brief...
Ligand InfoPC cidPC sid
In DepthDetails US Patent