BDBM484241 (S)-1-(2-(8-methyl-1-(4-(m- tolyloxy)phenyl)imidazo[1,5- a]pyrazin-3-yl)piperidin-1-yl)prop-2- en-1-one::US10933063, Compound 40::US11554118, Compound 40
SMILES Cc1cccc(Oc2ccc(cc2)-c2nc([C@@H]3CCCCN3C(=O)C=C)n3ccnc(C)c23)c1
InChI Key InChIKey=XEZCIZQOCGMSEV-DEOSSOPVSA-N
Data  2 IC50
  Tab Delimited (TSV)   2D SDfile   Computed 3D by Vconf -m prep SDfile
Find this compound or compounds like it in BindingDB:
Activity Spreadsheet -- Enzyme Inhibition Constant Data from BindingDB
Found 2 hits for monomerid = 484241
TargetTyrosine-protein kinase BTK(Homo sapiens (Human))
Suzhou Baijibugong Pharmaceutical Technology
US Patent
LigandPNGBDBM484241((S)-1-(2-(8-methyl-1-(4-(m- tolyloxy)phenyl)imidaz...)
Affinity DataIC50: <10nM. Assay description: Btk kinase activity was determined using a homogenous time resolved fluorescence (HTRF) methodology. Measurements were performed in a reaction volume...
Ligand InfoPC cidPC sid
In DepthDetails ArticleUS Patent
TargetTyrosine-protein kinase BTK(Homo sapiens (Human))
Suzhou Baijibugong Pharmaceutical Technology
US Patent
LigandPNGBDBM484241((S)-1-(2-(8-methyl-1-(4-(m- tolyloxy)phenyl)imidaz...)
Affinity DataIC50:  30nM. Assay description: Btk and Other Kinases: Btk kinase activity was determined using a homogenous time resolved fluorescence (HTRF) methodology. Measurements were perform...
Ligand InfoPC cidPC sid
In DepthDetails US Patent