BDBM484436 US10934285, Example 20
SMILES Nc1nc(cnc1Sc1cccc(NC(=O)c2c(O)nc3CCCCn3c2=O)c1Cl)N1CCC(N)(CC1)C(F)(F)F
InChI Key InChIKey=UJCZDSHOYXGRIK-UHFFFAOYSA-N
Data  1 IC50
  Tab Delimited (TSV)   2D SDfile   Computed 3D by Vconf -m prep SDfile
Find this compound or compounds like it in BindingDB:
Activity Spreadsheet -- Enzyme Inhibition Constant Data from BindingDB
Found 1 hit for monomerid = 484436
TargetSH2B adapter protein 2(Human)
Novartis
US Patent
LigandPNGBDBM484436(US10934285, Example 20)
Affinity DataIC50:  5.00E+3nM. Assay description: The inhibition of SHP2 by compounds of the invention (concentrations varying from 0.003-100 μM) was monitored using an assay in which 0.5 nM of ...
Ligand InfoPC cidPC sid
In DepthDetails US Patent