BDBM48460 MLS000528514::N-(5-Benzyl-[1,3,4]thiadiazol-2-yl)-2-thiophen-2-yl-acetamide::N-(5-benzyl-1,3,4-thiadiazol-2-yl)-2-(2-thienyl)acetamide::N-(5-benzyl-1,3,4-thiadiazol-2-yl)-2-thiophen-2-ylacetamide::N-[5-(phenylmethyl)-1,3,4-thiadiazol-2-yl]-2-thiophen-2-yl-ethanamide::N-[5-(phenylmethyl)-1,3,4-thiadiazol-2-yl]-2-thiophen-2-ylacetamide::SMR000121089::cid_900582
SMILES O=C(Cc1cccs1)Nc1nnc(Cc2ccccc2)s1
InChI Key InChIKey=JDAKJOKHVHDECZ-UHFFFAOYSA-N
Data  7 IC50
  Tab Delimited (TSV)   2D SDfile   Computed 3D by Vconf -m prep SDfile
Find this compound or compounds like it in BindingDB:
Activity Spreadsheet -- Enzyme Inhibition Constant Data from BindingDB
Found 7 hits for monomerid = 48460
TargetInduced myeloid leukemia cell differentiation protein Mcl-1(Homo sapiens (Human))
Emory University
Curated by PubChem BioAssay
LigandPNGBDBM48460(MLS000528514 | N-(5-Benzyl-[1,3,4]thiadiazol-2-yl)...)
Affinity DataIC50:  5.20E+3nM. Assay description: NIH Molecular Libraries Screening Centers Network [MLSCN] Emory Chemical Biology Discovery Center in MLSCN Assay provider: Nikolovska-Coleska, Univer...
In DepthDetails PCBioAssay
TargetEstrogen receptor beta(Homo sapiens (Human))
Emory University
Curated by PubChem BioAssay
LigandPNGBDBM48460(MLS000528514 | N-(5-Benzyl-[1,3,4]thiadiazol-2-yl)...)
Affinity DataIC50:  1.44E+4nM. Assay description: NIH Molecular Libraries Screening Centers Network [MLSCN] Emory Chemical Biology Discovery Center in MLSCN Assay provider: John A. Katzenellenbogen, ...
In DepthDetails PCBioAssay
TargetEstrogen receptor beta(Homo sapiens (Human))
Emory University
Curated by PubChem BioAssay
LigandPNGBDBM48460(MLS000528514 | N-(5-Benzyl-[1,3,4]thiadiazol-2-yl)...)
Affinity DataIC50:  1.70E+3nM. Assay description: NIH Molecular Libraries Screening Centers Network [MLSCN] Emory Chemical Biology Discovery Center in MLSCN Assay provider: John A. Katzenellenbogen, ...
In DepthDetails PCBioAssay
TargetDNA dC->dU-editing enzyme APOBEC-3G(Homo sapiens (Human))
Burnham Center For Chemical Genomics
Curated by PubChem BioAssay
LigandPNGBDBM48460(MLS000528514 | N-(5-Benzyl-[1,3,4]thiadiazol-2-yl)...)
Affinity DataIC50:  2.53E+4nMT: 2°C. Assay description: Data Source: Sanford-Burnham Center for Chemical Genomics (SBCCG) Source Affiliation: Sanford-Burnham Medical Research Institute (SBMRI, San Diego, C...
In DepthDetails PCBioAssay
TargetBcl-2-like protein 1(Homo sapiens (Human))
The Scripps Research Institute Molecular Screening Center
Curated by PubChem BioAssay
LigandPNGBDBM48460(MLS000528514 | N-(5-Benzyl-[1,3,4]thiadiazol-2-yl)...)
Affinity DataIC50:  1.09E+5nM. Assay description: Source (MLPCN Center Name): The Scripps Research Institute Molecular Screening Center Affiliation: The Scripps Research Institute, TSRI Assay Provide...
In DepthDetails PCBioAssay
TargetDNA dC->dU-editing enzyme APOBEC-3A(Homo sapiens (Human))
Burnham Center For Chemical Genomics
Curated by PubChem BioAssay
LigandPNGBDBM48460(MLS000528514 | N-(5-Benzyl-[1,3,4]thiadiazol-2-yl)...)
Affinity DataIC50:  1.20E+4nMT: 2°C. Assay description: Data Source: Sanford-Burnham Center for Chemical Genomics (SBCCG) Source Affiliation: Sanford-Burnham Medical Research Institute (SBMRI, San Diego, C...
In DepthDetails PCBioAssay
TargetInduced myeloid leukemia cell differentiation protein Mcl-1(Homo sapiens (Human))
Emory University
Curated by PubChem BioAssay
LigandPNGBDBM48460(MLS000528514 | N-(5-Benzyl-[1,3,4]thiadiazol-2-yl)...)
Affinity DataIC50:  7.40E+3nM. Assay description: Source (MLPCN Center Name): The Scripps Research Institute Molecular Screening Center Affiliation: The Scripps Research Institute, TSRI Assay Provide...
In DepthDetails PCBioAssay