BDBM48470 2-[(5,6-dimethyl-4-thieno[2,3-d]pyrimidinyl)thio]butanoic acid methyl ester::2-[(5,6-dimethylthieno[2,3-d]pyrimidin-4-yl)thio]butyric acid methyl ester::MLS000535327::SMR000142763::cid_2922139::methyl 2-(5,6-dimethylthieno[2,3-d]pyrimidin-4-yl)sulfanylbutanoate::methyl 2-[(5,6-dimethylthieno[2,3-d]pyrimidin-4-yl)thio]butanoate
SMILES CCC(Sc1ncnc2sc(C)c(C)c12)C(=O)OC
InChI Key InChIKey=OOUKYFUUFDBBHO-UHFFFAOYSA-N
Data  3 IC50
  Tab Delimited (TSV)   2D SDfile   Computed 3D by Vconf -m prep SDfile
Find this compound or compounds like it in BindingDB:
Activity Spreadsheet -- Enzyme Inhibition Constant Data from BindingDB
Found 3 hits for monomerid = 48470
TargetEstrogen receptor beta(Homo sapiens (Human))
Emory University
Curated by PubChem BioAssay
LigandPNGBDBM48470(2-[(5,6-dimethyl-4-thieno[2,3-d]pyrimidinyl)thio]b...)
Affinity DataIC50:  23nM. Assay description: NIH Molecular Libraries Screening Centers Network [MLSCN] Emory Chemical Biology Discovery Center in MLSCN Assay provider: John A. Katzenellenbogen, ...
In DepthDetails PCBioAssay
TargetMajor prion protein(Homo sapiens (Human))
The Scripps Research Institute Molecular Screening Center
Curated by PubChem BioAssay
LigandPNGBDBM48470(2-[(5,6-dimethyl-4-thieno[2,3-d]pyrimidinyl)thio]b...)
Affinity DataIC50:  2.46E+3nM. Assay description: Source (MLPCN Center Name): The Scripps Research Institute Molecular Screening Center (SRIMSC) Affiliation: The Scripps Research Institute, TSRI Assa...
In DepthDetails PCBioAssay
TargetEstrogen receptor beta(Homo sapiens (Human))
Emory University
Curated by PubChem BioAssay
LigandPNGBDBM48470(2-[(5,6-dimethyl-4-thieno[2,3-d]pyrimidinyl)thio]b...)
Affinity DataIC50:  1.41E+4nM. Assay description: NIH Molecular Libraries Screening Centers Network [MLSCN] Emory Chemical Biology Discovery Center in MLSCN Assay provider: John A. Katzenellenbogen, ...
In DepthDetails PCBioAssay