BDBM48474 4-methoxy-N-(6-methoxy-4H-indeno[1,2-d][1,3]thiazol-2-yl)benzamide::4-methoxy-N-(6-methoxy-4H-indeno[1,2-d]thiazol-2-yl)benzamide::MLS000519440::SMR000129859::cid_3553766
SMILES COc1ccc(cc1)C(=O)Nc1nc-2c(Cc3cc(OC)ccc-23)s1
InChI Key InChIKey=QVNUNVKGXKPTJR-UHFFFAOYSA-N
Data  9 IC50
  Tab Delimited (TSV)   2D SDfile   Computed 3D by Vconf -m prep SDfile
Find this compound or compounds like it in BindingDB:
Activity Spreadsheet -- Enzyme Inhibition Constant Data from BindingDB
Found 9 hits for monomerid = 48474
TargetInduced myeloid leukemia cell differentiation protein Mcl-1(Homo sapiens (Human))
Emory University
Curated by PubChem BioAssay
LigandPNGBDBM48474(4-methoxy-N-(6-methoxy-4H-indeno[1,2-d][1,3]thiazo...)
Affinity DataIC50:  3.75E+3nM. Assay description: NIH Molecular Libraries Screening Centers Network [MLSCN] Emory Chemical Biology Discovery Center in MLSCN Assay provider: Nikolovska-Coleska, Univer...
In DepthDetails PCBioAssay
TargetEstrogen receptor beta(Homo sapiens (Human))
Emory University
Curated by PubChem BioAssay
LigandPNGBDBM48474(4-methoxy-N-(6-methoxy-4H-indeno[1,2-d][1,3]thiazo...)
Affinity DataIC50:  23nM. Assay description: NIH Molecular Libraries Screening Centers Network [MLSCN] Emory Chemical Biology Discovery Center in MLSCN Assay provider: John A. Katzenellenbogen, ...
In DepthDetails PCBioAssay
TargetEstrogen receptor beta(Homo sapiens (Human))
Emory University
Curated by PubChem BioAssay
LigandPNGBDBM48474(4-methoxy-N-(6-methoxy-4H-indeno[1,2-d][1,3]thiazo...)
Affinity DataIC50:  5.00E+4nM. Assay description: NIH Molecular Libraries Screening Centers Network [MLSCN] Emory Chemical Biology Discovery Center in MLSCN Assay provider: John A. Katzenellenbogen, ...
In DepthDetails PCBioAssay
TargetSentrin-specific protease 8(Homo sapiens (Human))
Burnham Center For Chemical Genomics
Curated by PubChem BioAssay
LigandPNGBDBM48474(4-methoxy-N-(6-methoxy-4H-indeno[1,2-d][1,3]thiazo...)
Affinity DataIC50:  2.29E+3nM. Assay description: Data Source: Sanford-Burnham Center for Chemical Genomics (SBCCG) Source Affiliation: Sanford-Burnham Medical Research Institute (SBMRI, San Diego, C...
In DepthDetails PCBioAssay
TargetTyrosyl-DNA phosphodiesterase 2(Homo sapiens (Human))
The Scripps Research Institute Molecular Screening Center
Curated by PubChem BioAssay
LigandPNGBDBM48474(4-methoxy-N-(6-methoxy-4H-indeno[1,2-d][1,3]thiazo...)
Affinity DataIC50:  1.12E+4nM. Assay description: Source (MLPCN Center Name): The Scripps Research Institute Molecular Screening Center (SRIMSC) Center Affiliation: The Scripps Research Institute (TS...
In DepthDetails PCBioAssay
TargetCaspase-3(Homo sapiens (Human))
Burnham Center For Chemical Genomics
Curated by PubChem BioAssay
LigandPNGBDBM48474(4-methoxy-N-(6-methoxy-4H-indeno[1,2-d][1,3]thiazo...)
Affinity DataIC50:  3.45E+3nM. Assay description: Data Source: Sanford-Burnham Center for Chemical Genomics (SBCCG) Source Affiliation: Sanford-Burnham Medical Research Institute (SBMRI, San Diego, C...
In DepthDetails PCBioAssay
TargetApoptotic protease-activating factor 1(Homo sapiens (Human))
Burnham Center For Chemical Genomics
Curated by PubChem BioAssay
LigandPNGBDBM48474(4-methoxy-N-(6-methoxy-4H-indeno[1,2-d][1,3]thiazo...)
Affinity DataIC50:  5.11E+4nM. Assay description: Data Source: Sanford-Burnham Center for Chemical Genomics (SBCCG) Source Affiliation: Sanford-Burnham Medical Research Institute (SBIMR, San Diego, C...
In DepthDetails PCBioAssay
TargetApoptotic protease-activating factor 1(Homo sapiens (Human))
Burnham Center For Chemical Genomics
Curated by PubChem BioAssay
LigandPNGBDBM48474(4-methoxy-N-(6-methoxy-4H-indeno[1,2-d][1,3]thiazo...)
Affinity DataIC50: >1.00E+5nM. Assay description: Data Source: Sanford-Burnham Center for Chemical Genomics (SBCCG) Source Affiliation: Sanford-Burnham Medical Research Institute (SBIMR, San Diego, C...
In DepthDetails PCBioAssay
TargetSentrin-specific protease 6(Homo sapiens (Human))
Burnham Center For Chemical Genomics
Curated by PubChem BioAssay
LigandPNGBDBM48474(4-methoxy-N-(6-methoxy-4H-indeno[1,2-d][1,3]thiazo...)
Affinity DataIC50:  1.65E+3nM. Assay description: Data Source: Sanford-Burnham Center for Chemical Genomics (SBCCG) Source Affiliation: Sanford-Burnham Medical Research Institute (SBMRI, San Diego, C...
In DepthDetails PCBioAssay