BDBM48526 3-(2-Chloro-phenyl)-1-(6-methoxy-2-oxo-1,2-dihydro-quinolin-3-ylmethyl)-1-(2-pyrrolidin-1-yl-ethyl)-urea::3-(2-chlorophenyl)-1-[(2-keto-6-methoxy-1H-quinolin-3-yl)methyl]-1-(2-pyrrolidinoethyl)urea::3-(2-chlorophenyl)-1-[(6-methoxy-2-oxidanylidene-1H-quinolin-3-yl)methyl]-1-(2-pyrrolidin-1-ylethyl)urea::3-(2-chlorophenyl)-1-[(6-methoxy-2-oxo-1H-quinolin-3-yl)methyl]-1-(2-pyrrolidin-1-ylethyl)urea::3-(2-chlorophenyl)-1-[(6-methoxy-2-oxo-1H-quinolin-3-yl)methyl]-1-[2-(1-pyrrolidinyl)ethyl]urea::MLS000074351::SMR000004138::cid_651572
SMILES COc1ccc2[nH]c(=O)c(CN(CCN3CCCC3)C(=O)Nc3ccccc3Cl)cc2c1
InChI Key InChIKey=YNGXAIGJLHEMHY-UHFFFAOYSA-N
Data  6 IC50
  Tab Delimited (TSV)   2D SDfile   Computed 3D by Vconf -m prep SDfile
Find this compound or compounds like it in BindingDB:
Activity Spreadsheet -- Enzyme Inhibition Constant Data from BindingDB
Found 6 hits for monomerid = 48526
TargetEukaryotic translation initiation factor 4 gamma 1(Homo sapiens (Human))
Emory University
Curated by PubChem BioAssay
LigandPNGBDBM48526(3-(2-Chloro-phenyl)-1-(6-methoxy-2-oxo-1,2-dihydro...)
Affinity DataIC50:  6.40E+4nM. Assay description: Dose Response Confirmation for Small Molecule Inhibitors of Eukaryotic Translation Initiation NIH Molecular Libraries Screening Centers Network [MLSC...
In DepthDetails PCBioAssay
TargetNuclear receptor coactivator 3(Homo sapiens (Human))
The Scripps Research Institute Molecular Screening Center
Curated by PubChem BioAssay
LigandPNGBDBM48526(3-(2-Chloro-phenyl)-1-(6-methoxy-2-oxo-1,2-dihydro...)
Affinity DataIC50:  2.91E+4nM. Assay description: Source (MLPCN Center Name): The Scripps Research Institute Molecular Screening Center (SRIMSC) Affiliation: The Scripps Research Institute, TSRI Assa...
In DepthDetails PCBioAssay
TargetNuclear receptor coactivator 1(Homo sapiens (Human))
The Scripps Research Institute Molecular Screening Center
Curated by PubChem BioAssay
LigandPNGBDBM48526(3-(2-Chloro-phenyl)-1-(6-methoxy-2-oxo-1,2-dihydro...)
Affinity DataIC50: >3.58E+4nM. Assay description: Source (MLPCN Center Name): The Scripps Research Institute Molecular Screening Center (SRIMSC) Affiliation: The Scripps Research Institute, TSRI Assa...
In DepthDetails PCBioAssay
TargetNuclear receptor coactivator 1(Homo sapiens (Human))
The Scripps Research Institute Molecular Screening Center
Curated by PubChem BioAssay
LigandPNGBDBM48526(3-(2-Chloro-phenyl)-1-(6-methoxy-2-oxo-1,2-dihydro...)
Affinity DataIC50:  2.43E+4nM. Assay description: Source (MLPCN Center Name): The Scripps Research Institute Molecular Screening Center (SRIMSC) Affiliation: The Scripps Research Institute, TSRI Assa...
In DepthDetails PCBioAssay
TargetNuclear receptor coactivator 3(Homo sapiens (Human))
The Scripps Research Institute Molecular Screening Center
Curated by PubChem BioAssay
LigandPNGBDBM48526(3-(2-Chloro-phenyl)-1-(6-methoxy-2-oxo-1,2-dihydro...)
Affinity DataIC50:  8.71E+3nM. Assay description: Source (MLPCN Center Name): The Scripps Research Institute Molecular Screening Center (SRIMSC) Affiliation: The Scripps Research Institute, TSRI Assa...
In DepthDetails PCBioAssay
TargetTegument protein VP16(Human herpesvirus 1 (strain 17) (HHV-1) (Human her...)
The Scripps Research Institute Molecular Screening Center
Curated by PubChem BioAssay
LigandPNGBDBM48526(3-(2-Chloro-phenyl)-1-(6-methoxy-2-oxo-1,2-dihydro...)
Affinity DataIC50:  2.38E+4nM. Assay description: Source (MLPCN Center Name): The Scripps Research Institute Molecular Screening Center (SRIMSC) Affiliation: The Scripps Research Institute, TSRI Assa...
In DepthDetails PCBioAssay