BDBM48549 3-(4-methoxyphenyl)-6-oxidanylidene-8-thiophen-2-yl-2,4,7,8-tetrahydropyrido[2,1-b][1,3,5]thiadiazine-9-carbonitrile::3-(4-methoxyphenyl)-6-oxo-8-thiophen-2-yl-2,4,7,8-tetrahydropyrido[2,1-b][1,3,5]thiadiazine-9-carbonitrile::6-keto-3-(4-methoxyphenyl)-8-(2-thienyl)-2,4,7,8-tetrahydropyrido[2,1-b][1,3,5]thiadiazine-9-carbonitrile::MLS000080652::SMR000035441::cid_667173
SMILES COc1ccc(cc1)N1CSC2=C(C#N)C(CC(=O)N2C1)c1cccs1
InChI Key InChIKey=XFMAVVIPHIDUBH-UHFFFAOYSA-N
Data  5 IC50
  Tab Delimited (TSV)   2D SDfile   Computed 3D by Vconf -m prep SDfile
Find this compound or compounds like it in BindingDB:
Activity Spreadsheet -- Enzyme Inhibition Constant Data from BindingDB
Found 5 hits for monomerid = 48549
TargetEukaryotic translation initiation factor 4 gamma 1(Homo sapiens (Human))
Emory University
Curated by PubChem BioAssay
LigandPNGBDBM48549(3-(4-methoxyphenyl)-6-oxidanylidene-8-thiophen-2-y...)
Affinity DataIC50:  6.40E+4nM. Assay description: Dose Response Confirmation for Small Molecule Inhibitors of Eukaryotic Translation Initiation NIH Molecular Libraries Screening Centers Network [MLSC...
In DepthDetails PCBioAssay
TargetVoltage-dependent N-type calcium channel subunit alpha-1B(Homo sapiens (Human))
Burnham Center For Chemical Genomics
Curated by PubChem BioAssay
LigandPNGBDBM48549(3-(4-methoxyphenyl)-6-oxidanylidene-8-thiophen-2-y...)
Affinity DataIC50:  8.68E+3nM. Assay description: Data Source: Data Source: Sanford-Burnham Center for Chemical Genomics (SBCCG) Source Affiliation: Sanford-Burnham Medical Research Institute Network...
In DepthDetails PCBioAssay
TargetDNA dC->dU-editing enzyme APOBEC-3A(Homo sapiens (Human))
Burnham Center For Chemical Genomics
Curated by PubChem BioAssay
LigandPNGBDBM48549(3-(4-methoxyphenyl)-6-oxidanylidene-8-thiophen-2-y...)
Affinity DataIC50:  7.41E+4nMT: 2°C. Assay description: Data Source: Sanford-Burnham Center for Chemical Genomics (SBCCG) Source Affiliation: Sanford-Burnham Medical Research Institute (SBMRI, San Diego, C...
In DepthDetails PCBioAssay
TargetDNA dC->dU-editing enzyme APOBEC-3G(Homo sapiens (Human))
Burnham Center For Chemical Genomics
Curated by PubChem BioAssay
LigandPNGBDBM48549(3-(4-methoxyphenyl)-6-oxidanylidene-8-thiophen-2-y...)
Affinity DataIC50:  5.60E+3nMT: 2°C. Assay description: Data Source: Sanford-Burnham Center for Chemical Genomics (SBCCG) Source Affiliation: Sanford-Burnham Medical Research Institute (SBMRI, San Diego, C...
In DepthDetails PCBioAssay
TargetLarge T antigen(Simian virus 40)
Southern Research Specialized Biocontainment Screening Center
Curated by PubChem BioAssay
LigandPNGBDBM48549(3-(4-methoxyphenyl)-6-oxidanylidene-8-thiophen-2-y...)
Affinity DataIC50:  1.07E+4nM. Assay description: A biochemical assay using the ADP-Hunter methodology, purified TAg, and ATP to identify compounds that inhibit the ATPase activity of Tag Southern Re...
In DepthDetails PCBioAssay