BDBM485531 N-((1R,2S)-2-Acrylamidocyclopentyl)-5-(2-methyl-4-((6- methylpyridin-2-yl)oxy)phenyl)-4-oxo-4,5-dihydro-3H-1-thia-3,5,8- triazaacenaphthylene-2-carboxamide::US10934310, Ex # 368::US11319329, Ex # 368
SMILES Cc1cccc(Oc2ccc(c(C)c2)-n2c3ccnc4sc(C(=O)N[C@@H]5CCC[C@@H]5NC(=O)C=C)c([nH]c2=O)c34)n1
InChI Key
Data  2 IC50
  Tab Delimited (TSV)   2D SDfile   Computed 3D by Vconf -m prep SDfile
Find this compound or compounds like it in BindingDB:
Activity Spreadsheet -- Enzyme Inhibition Constant Data from BindingDB
Found 2 hits for monomerid = 485531
TargetTyrosine-protein kinase BTK(Homo sapiens (Human))
Janssen Pharmaceutica
US Patent
LigandPNGBDBM485531(N-((1R,2S)-2-Acrylamidocyclopentyl)-5-(2-methyl-4-...)
Affinity DataIC50:  7.41nM. Assay description: A BTK kinase lanthascreen binding assay monitors compound binding to unphosphorylated-BTK kinase domain (UP-BTK), by competing with a fluorescent lab...
Ligand InfoPC cidPC sid
In DepthDetails US Patent
TargetTyrosine-protein kinase BTK(Homo sapiens (Human))
Janssen Pharmaceutica
US Patent
LigandPNGBDBM485531(N-((1R,2S)-2-Acrylamidocyclopentyl)-5-(2-methyl-4-...)
Affinity DataIC50:  7.41nM. Assay description: A BTK kinase lanthascreen binding assay monitors compound binding to unphosphorylated-BTK kinase domain (UP-BTK), by competing with a fluorescent lab...
Ligand InfoPC cidPC sid
In DepthDetails US Patent