BDBM48556 2-[2-[[5-(furan-2-yl)-4-phenyl-1,2,4-triazol-3-yl]sulfanyl]ethanoylamino]-5,6-dihydro-4H-cyclopenta[b]thiophene-3-carboxamide::2-[[2-[[5-(2-furanyl)-4-phenyl-1,2,4-triazol-3-yl]thio]-1-oxoethyl]amino]-5,6-dihydro-4H-cyclopenta[b]thiophene-3-carboxamide::2-[[2-[[5-(2-furyl)-4-phenyl-1,2,4-triazol-3-yl]thio]acetyl]amino]-5,6-dihydro-4H-cyclopenta[b]thiophene-3-carboxamide::2-[[2-[[5-(furan-2-yl)-4-phenyl-1,2,4-triazol-3-yl]sulfanyl]acetyl]amino]-5,6-dihydro-4H-cyclopenta[b]thiophene-3-carboxamide::MLS000054014::SMR000063806::cid_2124800
SMILES NC(=O)c1c2CCCc2sc1NC(=O)CSc1nnc(-c2ccco2)n1-c1ccccc1
InChI Key InChIKey=JMCFWAQEGQCCDI-UHFFFAOYSA-N
Data  4 IC50
  Tab Delimited (TSV)   2D SDfile   Computed 3D by Vconf -m prep SDfile
Find this compound or compounds like it in BindingDB:
Activity Spreadsheet -- Enzyme Inhibition Constant Data from BindingDB
Found 4 hits for monomerid = 48556
TargetEukaryotic translation initiation factor 4 gamma 1(Homo sapiens (Human))
Emory University
Curated by PubChem BioAssay
LigandPNGBDBM48556(2-[2-[[5-(furan-2-yl)-4-phenyl-1,2,4-triazol-3-yl]...)
Affinity DataIC50:  6.40E+4nM. Assay description: Dose Response Confirmation for Small Molecule Inhibitors of Eukaryotic Translation Initiation NIH Molecular Libraries Screening Centers Network [MLSC...
In DepthDetails PCBioAssay
TargetGlycoprotein 42(Human herpesvirus 4 type 2)
Emory University
Curated by PubChem BioAssay
LigandPNGBDBM48556(2-[2-[[5-(furan-2-yl)-4-phenyl-1,2,4-triazol-3-yl]...)
Affinity DataIC50:  1.92E+4nM. Assay description: NIH Molecular Libraries Screening Centers Network [MLSCN] Emory Chemical Biology Discovery Center in MLSCN Assay provider: Theodore Jardetzky; Northw...
In DepthDetails PCBioAssay
TargetTyrosine-protein phosphatase non-receptor type 7(Homo sapiens (Human))
Burnham Center For Chemical Genomics
Curated by PubChem BioAssay
LigandPNGBDBM48556(2-[2-[[5-(furan-2-yl)-4-phenyl-1,2,4-triazol-3-yl]...)
Affinity DataIC50:  1.06E+4nM. Assay description: Data Source: Sanford-Burnham Center for Chemical Genomics (SBCCG) Source Affiliation: Sanford-Burnham Medical Research Institute (SBMRI, San Diego, C...
In DepthDetails PCBioAssay
TargetInduced myeloid leukemia cell differentiation protein Mcl-1(Homo sapiens (Human))
Emory University
Curated by PubChem BioAssay
LigandPNGBDBM48556(2-[2-[[5-(furan-2-yl)-4-phenyl-1,2,4-triazol-3-yl]...)
Affinity DataIC50:  5.89E+3nM. Assay description: NIH Molecular Libraries Screening Centers Network [MLSCN] Emory Chemical Biology Discovery Center in MLSCN Assay provider: Nikolovska-Coleska, Univer...
In DepthDetails PCBioAssay