BDBM485678 N-acetylaminoethyl-4-(2-bromo-3-phenylbenzyloxy)-2-(3-cyanobenzyloxy) benzylamine::US10941129, Example 1
SMILES CC(=O)NCCNCc1ccc(OCc2cccc(c2Br)-c2ccccc2)cc1OCc1cccc(c1)C#N
InChI Key InChIKey=IQLRLTODFXQGEP-UHFFFAOYSA-N
Data  1 IC50
  Tab Delimited (TSV)   2D SDfile   Computed 3D by Vconf -m prep SDfile
Find this compound or compounds like it in BindingDB:
Activity Spreadsheet -- Enzyme Inhibition Constant Data from BindingDB
Found 1 hit for monomerid = 485678
TargetProgrammed cell death 1 ligand/protein 1(Homo sapiens)
Institute Of Materia Medica, Chinese Academy Of Medical Sciences
US Patent
LigandPNGBDBM485678(N-acetylaminoethyl-4-(2-bromo-3-phenylbenzyloxy)-2...)
Affinity DataIC50:  439nM. Assay description: 1) Principle: PD-1 protein is with HIS tag, and PD-1 ligand PD-L1 is with hFc tag. Eu labeled anti-hFc antibody and XL665 labeled anti-HIS antibody a...
Ligand InfoPC cidPC sid
In DepthDetails US Patent