BDBM485736 N-methyl-3-(5- methylthiazol-2-yl)-3- (quinolin-5-yloxy)propan- 1-amine::US10941138, Example 34
SMILES CNCCC(Oc1cccc2ncccc12)c1ncc(C)s1
InChI Key InChIKey=CJYWHGYYPQJIHK-UHFFFAOYSA-N
Data  1 KI
  Tab Delimited (TSV)   2D SDfile   Computed 3D by Vconf -m prep SDfile
Find this compound or compounds like it in BindingDB:
Activity Spreadsheet -- Enzyme Inhibition Constant Data from BindingDB
Found 1 hit for monomerid = 485736
TargetVoltage-dependent calcium channel subunit alpha-2/delta-1(Homo sapiens (Human))
Esteve Pharmaceuticals
US Patent
LigandPNGBDBM485736(N-methyl-3-(5- methylthiazol-2-yl)-3- (quinolin-5-...)
Affinity DataKi:  1.75E+3nM. Assay description: Human α2δ-1 enriched membranes (2.5 μg) were incubated with 15 nM of radiolabeled [3H]-Gabapentin in assay buffer containing Hepes-KOH...
Ligand InfoPC cidPC sid
In DepthDetails US Patent