BDBM485765 (R)-N-methyl-3-(quinolin- 5-yloxy)-3-(thiophen-3- yl)propan-1-amine::US10941138, Example 63
SMILES CNCC[C@@H](Oc1cccc2ncccc12)c1ccsc1
InChI Key InChIKey=ZWHDVUZVJSBQRG-MRXNPFEDSA-N
Data  1 KI
  Tab Delimited (TSV)   2D SDfile   Computed 3D by Vconf -m prep SDfile
Find this compound or compounds like it in BindingDB:
Activity Spreadsheet -- Enzyme Inhibition Constant Data from BindingDB
Found 1 hit for monomerid = 485765
TargetVoltage-dependent calcium channel subunit alpha-2/delta-1(Homo sapiens (Human))
Esteve Pharmaceuticals
US Patent
LigandPNGBDBM485765((R)-N-methyl-3-(quinolin- 5-yloxy)-3-(thiophen-3- ...)
Affinity DataKi:  300nM. Assay description: Human α2δ-1 enriched membranes (2.5 μg) were incubated with 15 nM of radiolabeled [3H]-Gabapentin in assay buffer containing Hepes-KOH...
Ligand InfoPC cidPC sid
In DepthDetails US Patent