BDBM485821 US10946017, Compound 21
SMILES CN(CCNc1nc(Nc2ccc(OCCCOCCCCOCCCOCC(=O)N[C@H](C(=O)N3C[C@H](O)C[C@H]3C(=O)NCc3ccc(cc3)-c3scnc3C)C(C)(C)C)cc2)ncc1C(F)(F)F)C(=O)C1CCC1
InChI Key InChIKey=LKLXDZLUSNYCEJ-PPZGWQTASA-N
Data  1 IC50  1 Kd
  Tab Delimited (TSV)   2D SDfile   Computed 3D by Vconf -m prep SDfile
Find this compound or compounds like it in BindingDB:
Activity Spreadsheet -- Enzyme Inhibition Constant Data from BindingDB
Found 2 hits for monomerid = 485821
TargetSerine/threonine-protein kinase TBK1(Homo sapiens (Human))
Arvinas Operations
US Patent
LigandPNGBDBM485821(US10946017, Compound 21)
Affinity DataIC50:  29nM
Ligand InfoKEGGPC cidPC sid
In DepthDetails US Patent
TargetSerine/threonine-protein kinase TBK1(Homo sapiens (Human))
Arvinas Operations
US Patent
LigandPNGBDBM485821(US10946017, Compound 21)
Affinity DataKd:  13nM. Assay description: In vitro degradation assay protocol for compounds 3-33: Panc02.13 cells were purchased from ATCC and cultured in RPMI-1640 (Gibco), supplemented with...
Ligand InfoKEGGPC cidPC sid
In DepthDetails US Patent