BDBM486214 US10947210, Compound 11-6C
SMILES CNC(=O)c1c(oc2cc(N(CCOCCOCCc3ccc(cc3)C(O)=O)S(C)(=O)=O)c(cc12)C1CC1)-c1ccc(F)cc1
InChI Key InChIKey=ACNBHRHHEYQVSP-UHFFFAOYSA-N
Data  1 IC50
  Tab Delimited (TSV)   2D SDfile   Computed 3D by Vconf -m prep SDfile
Find this compound or compounds like it in BindingDB:
Activity Spreadsheet -- Enzyme Inhibition Constant Data from BindingDB
Found 1 hit for monomerid = 486214
TargetGenome polyprotein(Hepatitis C virus genotype 3a (isolate k3a) (HCV))
Cocrystal Pharma
US Patent
LigandPNGBDBM486214(US10947210, Compound 11-6C)
Affinity DataIC50:  550nM. Assay description: The reaction mixtures consisted of 50 mM Hepes-KOH, pH 7.5, 5 mM MgCl2, 5 mM DTT, 2% glycerol, 0.01% Triton® X-100, 0.5 uM polyA:U16 substrate, purif...
Ligand InfoPC cidPC sid
In DepthDetails US Patent