BDBM486294 US10947210, Compound 15-8
SMILES CNC(=O)c1c(oc2cc(N(CCCCCCOc3ccc(cc3)C(O)=O)S(C)(=O)=O)c(cc12)C1CC1)-c1ccc(F)cc1
InChI Key InChIKey=IENDIHBJPRRDEK-UHFFFAOYSA-N
Data  1 IC50
  Tab Delimited (TSV)   2D SDfile   Computed 3D by Vconf -m prep SDfile
Find this compound or compounds like it in BindingDB:
Activity Spreadsheet -- Enzyme Inhibition Constant Data from BindingDB
Found 1 hit for monomerid = 486294
TargetGenome polyprotein(Hepatitis C virus genotype 3a (isolate k3a) (HCV))
Cocrystal Pharma
US Patent
LigandPNGBDBM486294(US10947210, Compound 15-8)
Affinity DataIC50:  550nM. Assay description: The reaction mixtures consisted of 50 mM Hepes-KOH, pH 7.5, 5 mM MgCl2, 5 mM DTT, 2% glycerol, 0.01% Triton® X-100, 0.5 uM polyA:U16 substrate, purif...
Ligand InfoPC cidPC sid
In DepthDetails US Patent