BDBM48630 (8R,9S,13S,14S)-3-methoxy-13-methyl-7,8,9,11,12,14,15,16-octahydro-6H-cyclopenta[a]phenanthren-17-one::ESTRONE 3-METHYL ETHER::MLS000028621::SMR000058657::cid_92895
SMILES COc1ccc2[C@H]3CC[C@@]4(C)[C@@H](CCC4=O)[C@@H]3CCc2c1
InChI Key InChIKey=BCWWDWHFBMPLFQ-VXNCWWDNSA-N
Data  1 KI  1 IC50
  Tab Delimited (TSV)   2D SDfile   Computed 3D by Vconf -m prep SDfile
Find this compound or compounds like it in BindingDB:
Activity Spreadsheet -- Enzyme Inhibition Constant Data from BindingDB
Found 2 hits for monomerid = 48630
Target17-beta-hydroxysteroid dehydrogenase type 1(Homo sapiens (Human))
Bristol-Myers Squibb Pharmaceutical Research And Development
Curated by ChEMBL
LigandPNGBDBM48630((8R,9S,13S,14S)-3-methoxy-13-methyl-7,8,9,11,12,14...)
Affinity DataKi:  2.40E+4nM. Assay description: Inhibition of human estradiol 17beta-dehydrogenase
In DepthDetails ArticlePubMed
TargetEukaryotic translation initiation factor 4 gamma 1(Homo sapiens (Human))
Emory University
Curated by PubChem BioAssay
LigandPNGBDBM48630((8R,9S,13S,14S)-3-methoxy-13-methyl-7,8,9,11,12,14...)
Affinity DataIC50:  6.40E+4nM. Assay description: Dose Response Confirmation for Small Molecule Inhibitors of Eukaryotic Translation Initiation NIH Molecular Libraries Screening Centers Network [MLSC...
In DepthDetails PCBioAssay