BDBM486313 US10947210, Compound 23-6C
SMILES CNC(=O)c1c(oc2cc(N(CCOCCOCCOCC(=O)NO)S(C)(=O)=O)c(cc12)C1CC1)-c1ccc(F)cc1
InChI Key InChIKey=RHWWWAFYJDWRCW-UHFFFAOYSA-N
Data  1 IC50  1 EC50
  Tab Delimited (TSV)   2D SDfile   Computed 3D by Vconf -m prep SDfile
Find this compound or compounds like it in BindingDB:
Activity Spreadsheet -- Enzyme Inhibition Constant Data from BindingDB
Found 2 hits for monomerid = 486313
TargetGenome polyprotein(Hepatitis C virus genotype 3a (isolate k3a) (HCV))
Cocrystal Pharma
US Patent
LigandPNGBDBM486313(US10947210, Compound 23-6C)
Affinity DataEC50: <100nM. Assay description: HCV replicon assay is based on the luciferase reporter cell line (Huh-luc/neo-ET). This reporter cell line is a human liver carcinoma cell line (Huh-...
Ligand InfoPC cidPC sid
In DepthDetails US Patent
TargetGenome polyprotein(Hepatitis C virus genotype 3a (isolate k3a) (HCV))
Cocrystal Pharma
US Patent
LigandPNGBDBM486313(US10947210, Compound 23-6C)
Affinity DataIC50:  550nM. Assay description: The reaction mixtures consisted of 50 mM Hepes-KOH, pH 7.5, 5 mM MgCl2, 5 mM DTT, 2% glycerol, 0.01% Triton® X-100, 0.5 uM polyA:U16 substrate, purif...
Ligand InfoPC cidPC sid
In DepthDetails US Patent