BDBM486357 US10947222, Example 2-A
SMILES Fc1ccc(cc1)-n1cc(-c2ccccc2Cl)c2ccc(cc12)C(=O)N[C@@H]1CCS(=O)(=O)C1
InChI Key InChIKey=VCCRECHTQSAIAM-GOSISDBHSA-N
Data  1 IC50
  Tab Delimited (TSV)   2D SDfile   Computed 3D by Vconf -m prep SDfile
Find this compound or compounds like it in BindingDB:
Activity Spreadsheet -- Enzyme Inhibition Constant Data from BindingDB
Found 1 hit for monomerid = 486357
TargetDiacylglycerol O-acyltransferase 2(Homo sapiens (Human))
Merck Sharp & Dohme
US Patent
LigandPNGBDBM486357(US10947222, Example 2-A)
Affinity DataIC50:  171nM. Assay description: DGAT2 activity was determined by measuring the amount of enzymatic product triolein (1,2,3-Tri(cis-9-octadecenoyl)glycerol) using the membrane prep m...
Ligand InfoPC cidPC sid
In DepthDetails US Patent