BDBM486360 3-(2-chlorophenyl)-1-(4-fluorophenyl)- N-(2-methyl-1-morpholinopropan-2- yl)-1H-indole-6-carboxamide::US10947222, Example 4
SMILES CC(C)(CN1CCOCC1)NC(=O)c1ccc2c(cn(-c3ccc(F)cc3)c2c1)-c1ccccc1Cl
InChI Key InChIKey=GUTBRTWBNWPSNT-UHFFFAOYSA-N
Data  1 IC50
  Tab Delimited (TSV)   2D SDfile   Computed 3D by Vconf -m prep SDfile
Find this compound or compounds like it in BindingDB:
Activity Spreadsheet -- Enzyme Inhibition Constant Data from BindingDB
Found 1 hit for monomerid = 486360
TargetDiacylglycerol O-acyltransferase 2(Homo sapiens (Human))
Merck Sharp & Dohme
US Patent
LigandPNGBDBM486360(3-(2-chlorophenyl)-1-(4-fluorophenyl)- N-(2-methyl...)
Affinity DataIC50:  629nM. Assay description: DGAT2 activity was determined by measuring the amount of enzymatic product triolein (1,2,3-Tri(cis-9-octadecenoyl)glycerol) using the membrane prep m...
Ligand InfoPC cidPC sid
In DepthDetails US Patent