BDBM486461 Method #8::US10947226, Example 8
SMILES CN1c2cn(C)c(=O)cc2CC[C@@H](NC(=O)c2ncn(Cc3ccccc3)n2)C1=O
InChI Key InChIKey=GSFFWLPZGSAICB-MRXNPFEDSA-N
Data  1 KI
  Tab Delimited (TSV)   2D SDfile   Computed 3D by Vconf -m prep SDfile
Find this compound or compounds like it in BindingDB:
Activity Spreadsheet -- Enzyme Inhibition Constant Data from BindingDB
Found 1 hit for monomerid = 486461
TargetReceptor-interacting serine/threonine-protein kinase 1(Homo sapiens (Human))
Genentech
US Patent
LigandPNGBDBM486461(Method #8 | US10947226, Example 8)
Affinity DataKi: >1.00E+4nM. Assay description: Enzyme assay: The ability of the receptor interacting protein kinase (RIPK1) to catalyze the hydrolysis of adenosine-5′-triphosphate (ATP) is m...
Ligand InfoPC cidPC sid
In DepthDetails US Patent