BDBM486470 US10947226, Example 16
SMILES CN1c2cc(=O)n(CC3CC3)cc2CC[C@@H](NC(=O)c2nc3CC[C@@H](c4ccccc4F)n3n2)C1=O
InChI Key InChIKey=AOWCLNJKDKFJOV-UXHICEINSA-N
Data  1 KI
  Tab Delimited (TSV)   2D SDfile   Computed 3D by Vconf -m prep SDfile
Find this compound or compounds like it in BindingDB:
Activity Spreadsheet -- Enzyme Inhibition Constant Data from BindingDB
Found 1 hit for monomerid = 486470
TargetReceptor-interacting serine/threonine-protein kinase 1(Homo sapiens (Human))
Genentech
US Patent
LigandPNGBDBM486470(US10947226, Example 16)
Affinity DataKi:  6.90E+3nM. Assay description: Enzyme assay: The ability of the receptor interacting protein kinase (RIPK1) to catalyze the hydrolysis of adenosine-5′-triphosphate (ATP) is m...
Ligand InfoPC cidPC sid
In DepthDetails US Patent