BDBM486511 US10947241, Example 86
SMILES NC(CCC(O)=O)C(=O)N1CCN(CC1)c1nnc(-c2ccc(Cl)cc2)c2ccccc12
InChI Key InChIKey=NMGZVQHIILWVSH-UHFFFAOYSA-N
Data  1 IC50
  Tab Delimited (TSV)   2D SDfile   Computed 3D by Vconf -m prep SDfile
Find this compound or compounds like it in BindingDB:
Activity Spreadsheet -- Enzyme Inhibition Constant Data from BindingDB
Found 1 hit for monomerid = 486511
TargetResistin(Human)
Seoul National University Hospital
US Patent
LigandPNGBDBM486511(US10947241, Example 86)
Affinity DataIC50:  1.80E+4nM. Assay description: Using THP-1 (human monocyte) cell line and ELISA system, the abilities to inhibit TNF-α secretion by hResistin (IC50) were evaluated for the com...
Ligand InfoPC cidPC sid
In DepthDetails US Patent