BDBM486514 US10947241, Example 89
SMILES CNC1CCN(C1)c1nnc(-c2ccc(Cl)cc2)c2ccc(Cl)cc12
InChI Key InChIKey=NECQYXILAMEVFM-UHFFFAOYSA-N
Data  1 IC50
  Tab Delimited (TSV)   2D SDfile   Computed 3D by Vconf -m prep SDfile
Find this compound or compounds like it in BindingDB:
Activity Spreadsheet -- Enzyme Inhibition Constant Data from BindingDB
Found 1 hit for monomerid = 486514
TargetResistin(Human)
Seoul National University Hospital
US Patent
LigandPNGBDBM486514(US10947241, Example 89)
Affinity DataIC50:  1.80E+3nM. Assay description: Using THP-1 (human monocyte) cell line and ELISA system, the abilities to inhibit TNF-α secretion by hResistin (IC50) were evaluated for the com...
Ligand InfoPC cidPC sid
In DepthDetails US Patent