BDBM486525 8::US10947251, Example 7
SMILES COc1cc(c(F)cc1N1[C@@H]2CCN(C[C@H]2OCC1=O)S(=O)(=O)Nc1ccon1)-c1cc(ccc1F)C(F)(F)F
InChI Key InChIKey=CHWUFWAYVJAYOR-WIYYLYMNSA-N
Data  2 IC50
  Tab Delimited (TSV)   2D SDfile   Computed 3D by Vconf -m prep SDfile
Find this compound or compounds like it in BindingDB:
Activity Spreadsheet -- Enzyme Inhibition Constant Data from BindingDB
Found 2 hits for monomerid = 486525
TargetSodium channel protein type 9 subunit alpha(Homo sapiens (Human))
Genentech
US Patent
LigandPNGBDBM486525(8 | US10947251, Example 7)
Affinity DataIC50:  5.76nM. Assay description: Patch voltage clamp electrophysiology allows for the direct measurement and quantification of block of voltage-gated sodium channels (NaV's), and...
Ligand InfoPC cidPC sid
In DepthDetails US Patent
TargetSodium channel protein type 9 subunit alpha(Homo sapiens (Human))
Genentech
US Patent
LigandPNGBDBM486525(8 | US10947251, Example 7)
Affinity DataIC50:  167nM. Assay description: Heterologously Express hNav1.7 and the β1 SubunitPreparation of membranes containing recombinantly expressed sodium channels: Frozen recombinant...
Ligand InfoPC cidPC sid
In DepthDetails US Patent