BDBM486551 US10947251, Example 28
SMILES COc1cc(c(F)cc1N1CCO[C@H]2CN(CC[C@H]12)S(=O)(=O)Nc1ccncn1)-c1cccc(c1)C(F)(F)F
InChI Key InChIKey=XZYRACRHLCNRMY-REWPJTCUSA-N
Data  2 IC50
  Tab Delimited (TSV)   2D SDfile   Computed 3D by Vconf -m prep SDfile
Find this compound or compounds like it in BindingDB:
Activity Spreadsheet -- Enzyme Inhibition Constant Data from BindingDB
Found 2 hits for monomerid = 486551
TargetSodium channel protein type 9 subunit alpha(Homo sapiens (Human))
Genentech
US Patent
LigandPNGBDBM486551(US10947251, Example 28)
Affinity DataIC50:  2.10nM. Assay description: Patch voltage clamp electrophysiology allows for the direct measurement and quantification of block of voltage-gated sodium channels (NaV's), and...
Ligand InfoPC cidPC sid
In DepthDetails US Patent
TargetSodium channel protein type 9 subunit alpha(Homo sapiens (Human))
Genentech
US Patent
LigandPNGBDBM486551(US10947251, Example 28)
Affinity DataIC50:  26.3nM. Assay description: Heterologously Express hNav1.7 and the β1 SubunitPreparation of membranes containing recombinantly expressed sodium channels: Frozen recombinant...
Ligand InfoPC cidPC sid
In DepthDetails US Patent