BDBM486757 US10947215, Example 388
SMILES CCc1cc(CO[C@H]2CN(C[C@@H]2NC(=O)c2cc(Br)cnc2N)C(=O)OC(C)(C)C)ccc1C
InChI Key InChIKey=RKLAVYJOUIQBFQ-SFTDATJTSA-N
Data  1 IC50
  Tab Delimited (TSV)   2D SDfile   Computed 3D by Vconf -m prep SDfile
Find this compound or compounds like it in BindingDB:
Activity Spreadsheet -- Enzyme Inhibition Constant Data from BindingDB
Found 1 hit for monomerid = 486757
TargetTyrosine-protein kinase Mer/receptor UFO(Homo sapiens (Human))
Dong-A Socio Holdings
US Patent
LigandPNGBDBM486757(US10947215, Example 388)
Affinity DataIC50: <10nM. Assay description: For the SAR (structure-activity relationship) and compound screening, LanthaScreen™ TR-FRET (Time-Resolved fluorescence energy transfer) assay was em...
Ligand InfoPC cidPC sid
In DepthDetails US Patent