BDBM487508 US10954193, Example 41
SMILES COc1ccc(Oc2ccc(cc2)S(=O)(=O)NC(=O)CCn2cc(CCCOc3cc(C)c(Cl)c(C)c3)c3ccc(Cl)cc23)cc1
InChI Key InChIKey=HWYSFVQXOSNUIU-UHFFFAOYSA-N
Data  1 IC50
  Tab Delimited (TSV)   2D SDfile   Computed 3D by Vconf -m prep SDfile
Find this compound or compounds like it in BindingDB:
Activity Spreadsheet -- Enzyme Inhibition Constant Data from BindingDB
Found 1 hit for monomerid = 487508
TargetInduced myeloid leukemia cell differentiation protein Mcl-1(Homo sapiens (Human))
Vanderbilt University
US Patent
LigandPNGBDBM487508(US10954193, Example 41)
Affinity DataIC50:  200nM. Assay description: Compound affinity was measured using a fluorescence polarization anisotropy competition assay. Anisotropy measurements were carried out in 384-well, ...
Ligand InfoPC cidPC sid
In DepthDetails US Patent