BDBM487518 US10954193, Example 101
SMILES Cc1c(CCCOc2cc(C)c(Cl)c(C)c2)c2ccc(Cl)c(Br)c2n1CCC(O)=O
InChI Key InChIKey=OQQRXSLUDAJAIV-UHFFFAOYSA-N
Data  1 IC50
  Tab Delimited (TSV)   2D SDfile   Computed 3D by Vconf -m prep SDfile
Find this compound or compounds like it in BindingDB:
Activity Spreadsheet -- Enzyme Inhibition Constant Data from BindingDB
Found 1 hit for monomerid = 487518
TargetInduced myeloid leukemia cell differentiation protein Mcl-1(Homo sapiens (Human))
Vanderbilt University
US Patent
LigandPNGBDBM487518(US10954193, Example 101)
Affinity DataIC50:  200nM. Assay description: Compound affinity was measured using a fluorescence polarization anisotropy competition assay. Anisotropy measurements were carried out in 384-well, ...
Ligand InfoPC cidPC sid
In DepthDetails US Patent