BDBM487536 US10954193, Example 80
SMILES Cc1nn(CCN2CCCC2)c(C)c1-c1cccc2c(CCCOc3cc(C)c(Cl)c(C)c3)c(C)n(CCC(O)=O)c12
InChI Key InChIKey=RBTIBWQUVHFMFW-UHFFFAOYSA-N
Data  1 IC50
  Tab Delimited (TSV)   2D SDfile   Computed 3D by Vconf -m prep SDfile
Find this compound or compounds like it in BindingDB:
Activity Spreadsheet -- Enzyme Inhibition Constant Data from BindingDB
Found 1 hit for monomerid = 487536
TargetInduced myeloid leukemia cell differentiation protein Mcl-1(Homo sapiens (Human))
Vanderbilt University
US Patent
LigandPNGBDBM487536(US10954193, Example 80)
Affinity DataIC50: <100nM. Assay description: Compound affinity was measured using a fluorescence polarization anisotropy competition assay. Anisotropy measurements were carried out in 384-well, ...
Ligand InfoPC cidPC sid
In DepthDetails US Patent