BDBM487566 US10954193, Example 120
SMILES Cc1nn(C)c(C)c1-c1cccc2c(CCCOc3cc(C)c(Cl)c(C)c3)c(n(CC(O)=O)c12)C(F)(F)F
InChI Key InChIKey=PTAPMVCPXSIZNF-UHFFFAOYSA-N
Data  1 IC50
  Tab Delimited (TSV)   2D SDfile   Computed 3D by Vconf -m prep SDfile
Find this compound or compounds like it in BindingDB:
Activity Spreadsheet -- Enzyme Inhibition Constant Data from BindingDB
Found 1 hit for monomerid = 487566
TargetInduced myeloid leukemia cell differentiation protein Mcl-1(Homo sapiens (Human))
Vanderbilt University
US Patent
LigandPNGBDBM487566(US10954193, Example 120)
Affinity DataIC50: <100nM. Assay description: Compound affinity was measured using a fluorescence polarization anisotropy competition assay. Anisotropy measurements were carried out in 384-well, ...
Ligand InfoPC cidPC sid
In DepthDetails US Patent