BDBM487579 US10954193, Example 135
SMILES Cc1cc(OCCCc2c(n(CCC(O)=O)c3ccccc23)C(F)(F)F)cc(C)c1Cl
InChI Key InChIKey=RAIMGGIZLUQNEE-UHFFFAOYSA-N
Data  1 IC50
  Tab Delimited (TSV)   2D SDfile   Computed 3D by Vconf -m prep SDfile
Find this compound or compounds like it in BindingDB:
Activity Spreadsheet -- Enzyme Inhibition Constant Data from BindingDB
Found 1 hit for monomerid = 487579
TargetInduced myeloid leukemia cell differentiation protein Mcl-1(Homo sapiens (Human))
Vanderbilt University
US Patent
LigandPNGBDBM487579(US10954193, Example 135)
Affinity DataIC50: <100nM. Assay description: Compound affinity was measured using a fluorescence polarization anisotropy competition assay. Anisotropy measurements were carried out in 384-well, ...
Ligand InfoPC cidPC sid
In DepthDetails US Patent