BDBM487730 N-(5-cyano-6-(2H-1,2,3-triazol- 2-yl)pyridin-3-yl)-1-(4-fluoro-2- methoxyphenyl)-5- (trifluoromethyl)-1H-pyrazole-4- carboxamide::US10954214, Compound 152
SMILES FC(F)(F)c1c(cnn1-c1ccnc2ccccc12)C(=O)Nc1ccc(c(c1)C#N)-n1nccn1
InChI Key InChIKey=WWEJSTTYLRIYAF-UHFFFAOYSA-N
Data  1 IC50
  Tab Delimited (TSV)   2D SDfile   Computed 3D by Vconf -m prep SDfile
Find this compound or compounds like it in BindingDB:
Activity Spreadsheet -- Enzyme Inhibition Constant Data from BindingDB
Found 1 hit for monomerid = 487730
TargetMucosa-associated lymphoid tissue lymphoma translocation protein 1(Homo sapiens (Human))
Janssen Pharmaceutica
US Patent
LigandPNGBDBM487730(N-(5-cyano-6-(2H-1,2,3-triazol- 2-yl)pyridin-3-yl)...)
Affinity DataIC50:  18nM. Assay description: MALT1 protease activity was assessed in an in vitro assay using a tetrapeptide as substrate and full-length MALT1 protein (Strep-MALT1(1-824)-His) pu...
Ligand InfoPC cidPC sid
In DepthDetails US Patent