BDBM488009 (S)-N-(5-chloro-6-(2H-1,2,3- triazol-2-yl)pyridin-3-yl)-1-(7- (3-hydroxypyrrolidin-1- yl)thieno[2,3-c]pyridin-4-yl)-5- (trifluoromethyl)-1H-pyrazole-4- carboxamide::US10954214, Compound 431
SMILES O[C@H]1CCN(C1)c1ncc(-n2ncc(C(=O)Nc3cnc(c(Cl)c3)-n3nccn3)c2C(F)(F)F)c2ccsc12
InChI Key InChIKey=VRCPWWRVZICCRA-ZDUSSCGKSA-N
Data  1 IC50
  Tab Delimited (TSV)   2D SDfile   Computed 3D by Vconf -m prep SDfile
Find this compound or compounds like it in BindingDB:
Activity Spreadsheet -- Enzyme Inhibition Constant Data from BindingDB
Found 1 hit for monomerid = 488009
TargetMucosa-associated lymphoid tissue lymphoma translocation protein 1(Homo sapiens (Human))
Janssen Pharmaceutica
US Patent
LigandPNGBDBM488009((S)-N-(5-chloro-6-(2H-1,2,3- triazol-2-yl)pyridin-...)
Affinity DataIC50:  17nM. Assay description: MALT1 protease activity was assessed in an in vitro assay using a tetrapeptide as substrate and full-length MALT1 protein (Strep-MALT1(1-824)-His) pu...
Ligand InfoPC cidPC sid
In DepthDetails US Patent