BDBM48827 3-[(5Z)-4-keto-5-[[1-phenyl-3-(2-thienyl)pyrazol-4-yl]methylene]-2-thioxo-thiazolidin-3-yl]propionic acid::3-[(5Z)-4-oxidanylidene-5-[(1-phenyl-3-thiophen-2-yl-pyrazol-4-yl)methylidene]-2-sulfanylidene-1,3-thiazolidin-3-yl]propanoic acid::3-[(5Z)-4-oxo-5-[(1-phenyl-3-thiophen-2-yl-4-pyrazolyl)methylidene]-2-sulfanylidene-3-thiazolidinyl]propanoic acid::3-[(5Z)-4-oxo-5-[(1-phenyl-3-thiophen-2-ylpyrazol-4-yl)methylidene]-2-sulfanylidene-1,3-thiazolidin-3-yl]propanoic acid::MLS000703572::SMR000273937::cid_1905127
SMILES OC(=O)CCN1C(=S)S\C(=C/c2cn(nc2-c2cccs2)-c2ccccc2)C1=O
InChI Key InChIKey=YWLDDBSYVUMQCK-WJDWOHSUSA-N
Data  5 IC50
  Tab Delimited (TSV)   2D SDfile   Computed 3D by Vconf -m prep SDfile
Find this compound or compounds like it in BindingDB:
Activity Spreadsheet -- Enzyme Inhibition Constant Data from BindingDB
Found 5 hits for monomerid = 48827
TargetEukaryotic translation initiation factor 4 gamma 1(Homo sapiens (Human))
Emory University
Curated by PubChem BioAssay
LigandPNGBDBM48827(3-[(5Z)-4-keto-5-[[1-phenyl-3-(2-thienyl)pyrazol-4...)
Affinity DataIC50:  5.00E+4nM. Assay description: Dose Response Confirmation for Small Molecule Inhibitors of Eukaryotic Translation Initiation NIH Molecular Libraries Screening Centers Network [MLSC...
In DepthDetails PCBioAssay
TargetInduced myeloid leukemia cell differentiation protein Mcl-1(Homo sapiens (Human))
Emory University
Curated by PubChem BioAssay
LigandPNGBDBM48827(3-[(5Z)-4-keto-5-[[1-phenyl-3-(2-thienyl)pyrazol-4...)
Affinity DataIC50:  3.24E+3nM. Assay description: NIH Molecular Libraries Screening Centers Network [MLSCN] Emory Chemical Biology Discovery Center in MLSCN Assay provider: Nikolovska-Coleska, Univer...
In DepthDetails PCBioAssay
TargetPlectin(Homo sapiens (Human))
Burnham Center For Chemical Genomics
Curated by PubChem BioAssay
LigandPNGBDBM48827(3-[(5Z)-4-keto-5-[[1-phenyl-3-(2-thienyl)pyrazol-4...)
Affinity DataIC50:  2.00E+5nM. Assay description: Data Source: Sanford-Burnham Center for Chemical Genomics (SBCCG) Source Affiliation: Sanford-Burnham Medical Research Institute (SBMRI, San Diego, C...
In DepthDetails PCBioAssay
TargetM17 leucyl aminopeptidase(Plasmodium falciparum 3D7)
Srmlsc
Curated by PubChem BioAssay
LigandPNGBDBM48827(3-[(5Z)-4-keto-5-[[1-phenyl-3-(2-thienyl)pyrazol-4...)
Affinity DataIC50:  3.05E+3nM. Assay description: Southern Research Molecular Libraries Screening Center (SRMLSC) Southern Research Institute (Birmingham, Alabama) NIH Molecular Libraries Screening...
In DepthDetails PCBioAssay
TargetPlectin(Homo sapiens (Human))
Burnham Center For Chemical Genomics
Curated by PubChem BioAssay
LigandPNGBDBM48827(3-[(5Z)-4-keto-5-[[1-phenyl-3-(2-thienyl)pyrazol-4...)
Affinity DataIC50:  2.10E+4nM. Assay description: Data Source: Sanford-Burnham Center for Chemical Genomics (SBCCG) Source Affiliation: Sanford-Burnham Medical Research Institute (SBMRI, San Diego, C...
In DepthDetails PCBioAssay