BDBM488368 2-(4-Amino-1-(tert-butyl)-1H-pyrazolo[3,4- d]pyrimidin-3-yl)-3-bromo-N-methyl-1H-indole-6- carboxamide::US10954241, Example 8::US11548896, Example 8
SMILES CNC(=O)c1ccc2c(Br)c([nH]c2c1)-c1nn(c2ncnc(N)c12)C(C)(C)C
InChI Key InChIKey=OGUFXWBZNKEOCD-UHFFFAOYSA-N
Data  6 IC50
  Tab Delimited (TSV)   2D SDfile   Computed 3D by Vconf -m prep SDfile
Find this compound or compounds like it in BindingDB:
Activity Spreadsheet -- Enzyme Inhibition Constant Data from BindingDB
Found 6 hits for monomerid = 488368
TargetProto-oncogene tyrosine-protein kinase receptor Ret(Homo sapiens (Human))
Cancer Research Technology
US Patent
LigandPNGBDBM488368(2-(4-Amino-1-(tert-butyl)-1H-pyrazolo[3,4- d]pyrim...)
Affinity DataIC50:  14.7nM. Assay description: Kinase activity was detected using CisBio HTRF kinEASE kit based on time-resolved fluorescence transfer (FRET). The assay was performed in 384-well w...
Ligand InfoPC cidPC sid
In DepthDetails US Patent
TargetVascular endothelial growth factor receptor 2(Homo sapiens (Human))
Cancer Research Technology
US Patent
LigandPNGBDBM488368(2-(4-Amino-1-(tert-butyl)-1H-pyrazolo[3,4- d]pyrim...)
Affinity DataIC50:  9.01E+3nM. Assay description: Kinase activity was detected using CisBio HTRF kinEASE kit based on time-resolved fluorescence transfer (FRET). The assay was performed in 384-well w...
Ligand InfoPC cidPC sid
In DepthDetails US Patent
TargetProto-oncogene tyrosine-protein kinase receptor Ret [V804M](Homo sapiens (Human))
Cancer Research Technology
US Patent
LigandPNGBDBM488368(2-(4-Amino-1-(tert-butyl)-1H-pyrazolo[3,4- d]pyrim...)
Affinity DataIC50:  40.7nM. Assay description: RET, RETV804M and KDR: Kinase activity was detected using CisBio HTRF kinEASE kit based on time-resolved fluorescence transfer (FRET). The assay was ...
Ligand InfoPC cidPC sid
In DepthDetails US Patent
TargetProto-oncogene tyrosine-protein kinase receptor Ret(Homo sapiens (Human))
Cancer Research Technology
US Patent
LigandPNGBDBM488368(2-(4-Amino-1-(tert-butyl)-1H-pyrazolo[3,4- d]pyrim...)
Affinity DataIC50:  14.7nM. Assay description: RET, RETV804M and KDR: Kinase activity was detected using CisBio HTRF kinEASE kit based on time-resolved fluorescence transfer (FRET). The assay was ...
Ligand InfoPC cidPC sid
In DepthDetails US Patent
TargetVascular endothelial growth factor receptor 2(Homo sapiens (Human))
Cancer Research Technology
US Patent
LigandPNGBDBM488368(2-(4-Amino-1-(tert-butyl)-1H-pyrazolo[3,4- d]pyrim...)
Affinity DataIC50:  9.01E+3nM. Assay description: RET, RETV804M and KDR: Kinase activity was detected using CisBio HTRF kinEASE kit based on time-resolved fluorescence transfer (FRET). The assay was ...
Ligand InfoPC cidPC sid
In DepthDetails US Patent
TargetProto-oncogene tyrosine-protein kinase receptor Ret [V804M](Homo sapiens (Human))
Cancer Research Technology
US Patent
LigandPNGBDBM488368(2-(4-Amino-1-(tert-butyl)-1H-pyrazolo[3,4- d]pyrim...)
Affinity DataIC50:  40.7nM. Assay description: Kinase activity was detected using CisBio HTRF kinEASE kit based on time-resolved fluorescence transfer (FRET). The assay was performed in 384-well w...
Ligand InfoPC cidPC sid
In DepthDetails US Patent