BDBM488369 2-(8-Amino-3-isopropylimidazo[1,5-a]pyrazin-1- yl)-3-chloro-N-methyl-1H-indole-6-carboxamide::US10954241, Example 9::US11548896, Example 9
SMILES CNC(=O)c1ccc2c(Cl)c([nH]c2c1)-c1nc(C(C)C)n2ccnc(N)c12
InChI Key InChIKey=BQUHSWVUQMWBKQ-UHFFFAOYSA-N
Data  6 IC50
  Tab Delimited (TSV)   2D SDfile   Computed 3D by Vconf -m prep SDfile
Find this compound or compounds like it in BindingDB:
Activity Spreadsheet -- Enzyme Inhibition Constant Data from BindingDB
Found 6 hits for monomerid = 488369
TargetProto-oncogene tyrosine-protein kinase receptor Ret(Homo sapiens (Human))
Cancer Research Technology
US Patent
LigandPNGBDBM488369(2-(8-Amino-3-isopropylimidazo[1,5-a]pyrazin-1- yl)...)
Affinity DataIC50:  4.53nM. Assay description: Kinase activity was detected using CisBio HTRF kinEASE kit based on time-resolved fluorescence transfer (FRET). The assay was performed in 384-well w...
Ligand InfoPC cidPC sid
In DepthDetails US Patent
TargetVascular endothelial growth factor receptor 2(Homo sapiens (Human))
Cancer Research Technology
US Patent
LigandPNGBDBM488369(2-(8-Amino-3-isopropylimidazo[1,5-a]pyrazin-1- yl)...)
Affinity DataIC50:  1.18E+3nM. Assay description: Kinase activity was detected using CisBio HTRF kinEASE kit based on time-resolved fluorescence transfer (FRET). The assay was performed in 384-well w...
Ligand InfoPC cidPC sid
In DepthDetails US Patent
TargetProto-oncogene tyrosine-protein kinase receptor Ret [V804M](Homo sapiens (Human))
Cancer Research Technology
US Patent
LigandPNGBDBM488369(2-(8-Amino-3-isopropylimidazo[1,5-a]pyrazin-1- yl)...)
Affinity DataIC50:  14.8nM. Assay description: RET, RETV804M and KDR: Kinase activity was detected using CisBio HTRF kinEASE kit based on time-resolved fluorescence transfer (FRET). The assay was ...
Ligand InfoPC cidPC sid
In DepthDetails US Patent
TargetProto-oncogene tyrosine-protein kinase receptor Ret(Homo sapiens (Human))
Cancer Research Technology
US Patent
LigandPNGBDBM488369(2-(8-Amino-3-isopropylimidazo[1,5-a]pyrazin-1- yl)...)
Affinity DataIC50:  4.53nM. Assay description: RET, RETV804M and KDR: Kinase activity was detected using CisBio HTRF kinEASE kit based on time-resolved fluorescence transfer (FRET). The assay was ...
Ligand InfoPC cidPC sid
In DepthDetails US Patent
TargetVascular endothelial growth factor receptor 2(Homo sapiens (Human))
Cancer Research Technology
US Patent
LigandPNGBDBM488369(2-(8-Amino-3-isopropylimidazo[1,5-a]pyrazin-1- yl)...)
Affinity DataIC50:  1.18E+3nM. Assay description: RET, RETV804M and KDR: Kinase activity was detected using CisBio HTRF kinEASE kit based on time-resolved fluorescence transfer (FRET). The assay was ...
Ligand InfoPC cidPC sid
In DepthDetails US Patent
TargetProto-oncogene tyrosine-protein kinase receptor Ret [V804M](Homo sapiens (Human))
Cancer Research Technology
US Patent
LigandPNGBDBM488369(2-(8-Amino-3-isopropylimidazo[1,5-a]pyrazin-1- yl)...)
Affinity DataIC50:  14.8nM. Assay description: Kinase activity was detected using CisBio HTRF kinEASE kit based on time-resolved fluorescence transfer (FRET). The assay was performed in 384-well w...
Ligand InfoPC cidPC sid
In DepthDetails US Patent