BDBM488469 3-(3-Chloro-6-oxazol-2-yl-1H-indol-2-yl)-1- isopropyl-pyrazolo[3,4-d]pyrimidin-4-amine::US10954241, Example 109::US11548896, Example 109
SMILES CC(C)n1nc(-c2[nH]c3cc(ccc3c2Cl)-c2ncco2)c2c(N)ncnc12
InChI Key InChIKey=NSZXLMVQBNISCL-UHFFFAOYSA-N
Data  6 IC50
  Tab Delimited (TSV)   2D SDfile   Computed 3D by Vconf -m prep SDfile
Find this compound or compounds like it in BindingDB:
Activity Spreadsheet -- Enzyme Inhibition Constant Data from BindingDB
Found 6 hits for monomerid = 488469
TargetProto-oncogene tyrosine-protein kinase receptor Ret(Homo sapiens (Human))
Cancer Research Technology
US Patent
LigandPNGBDBM488469(3-(3-Chloro-6-oxazol-2-yl-1H-indol-2-yl)-1- isopro...)
Affinity DataIC50:  6.29nM. Assay description: Kinase activity was detected using CisBio HTRF kinEASE kit based on time-resolved fluorescence transfer (FRET). The assay was performed in 384-well w...
Ligand InfoPC cidPC sid
In DepthDetails US Patent
TargetVascular endothelial growth factor receptor 2(Homo sapiens (Human))
Cancer Research Technology
US Patent
LigandPNGBDBM488469(3-(3-Chloro-6-oxazol-2-yl-1H-indol-2-yl)-1- isopro...)
Affinity DataIC50:  894nM. Assay description: Kinase activity was detected using CisBio HTRF kinEASE kit based on time-resolved fluorescence transfer (FRET). The assay was performed in 384-well w...
Ligand InfoPC cidPC sid
In DepthDetails US Patent
TargetProto-oncogene tyrosine-protein kinase receptor Ret [V804M](Homo sapiens (Human))
Cancer Research Technology
US Patent
LigandPNGBDBM488469(3-(3-Chloro-6-oxazol-2-yl-1H-indol-2-yl)-1- isopro...)
Affinity DataIC50:  47.3nM. Assay description: RET, RETV804M and KDR: Kinase activity was detected using CisBio HTRF kinEASE kit based on time-resolved fluorescence transfer (FRET). The assay was ...
Ligand InfoPC cidPC sid
In DepthDetails US Patent
TargetProto-oncogene tyrosine-protein kinase receptor Ret(Homo sapiens (Human))
Cancer Research Technology
US Patent
LigandPNGBDBM488469(3-(3-Chloro-6-oxazol-2-yl-1H-indol-2-yl)-1- isopro...)
Affinity DataIC50:  6.29nM. Assay description: RET, RETV804M and KDR: Kinase activity was detected using CisBio HTRF kinEASE kit based on time-resolved fluorescence transfer (FRET). The assay was ...
Ligand InfoPC cidPC sid
In DepthDetails US Patent
TargetVascular endothelial growth factor receptor 2(Homo sapiens (Human))
Cancer Research Technology
US Patent
LigandPNGBDBM488469(3-(3-Chloro-6-oxazol-2-yl-1H-indol-2-yl)-1- isopro...)
Affinity DataIC50:  894nM. Assay description: RET, RETV804M and KDR: Kinase activity was detected using CisBio HTRF kinEASE kit based on time-resolved fluorescence transfer (FRET). The assay was ...
Ligand InfoPC cidPC sid
In DepthDetails US Patent
TargetProto-oncogene tyrosine-protein kinase receptor Ret [V804M](Homo sapiens (Human))
Cancer Research Technology
US Patent
LigandPNGBDBM488469(3-(3-Chloro-6-oxazol-2-yl-1H-indol-2-yl)-1- isopro...)
Affinity DataIC50:  47.3nM. Assay description: Kinase activity was detected using CisBio HTRF kinEASE kit based on time-resolved fluorescence transfer (FRET). The assay was performed in 384-well w...
Ligand InfoPC cidPC sid
In DepthDetails US Patent