BDBM488568 US10954253, Compound 75
SMILES CN1CCC2(CC1)CCN(CC2)c1ccc(Nc2ncc3c(n2)n(-c2cccc(n2)[C@](C)(O)C(F)(F)F)n(CC=C)c3=O)cc1
InChI Key InChIKey=UDZDBPDXPUMHQE-PMERELPUSA-N
Data  1 IC50
  Tab Delimited (TSV)   2D SDfile   Computed 3D by Vconf -m prep SDfile
Find this compound or compounds like it in BindingDB:
Activity Spreadsheet -- Enzyme Inhibition Constant Data from BindingDB
Found 1 hit for monomerid = 488568
TargetWee1-like protein kinase(Homo sapiens (Human))
Shijiazhuang Sagacity New Drug Development
US Patent
LigandPNGBDBM488568(US10954253, Compound 75)
Affinity DataIC50:  17nM. Assay description: Experimental Reagents:Basic reaction buffer: 20 mM hydroxyethylpiperazine ethanesulfuric acid (pH 7.5), 10 mM magnesium chloride, 1 mM EGTA, 0.02% Br...
Ligand InfoPC cidPC sid
In DepthDetails US Patent