BDBM48958 2-[[2-[[5-[(2-amino-4-thiazolyl)methyl]-4-methyl-1,2,4-triazol-3-yl]thio]-1-oxoethyl]amino]-4,5-dimethyl-3-thiophenecarboxylic acid ethyl ester::2-[[2-[[5-[(2-aminothiazol-4-yl)methyl]-4-methyl-1,2,4-triazol-3-yl]thio]acetyl]amino]-4,5-dimethyl-thiophene-3-carboxylic acid ethyl ester::MLS000052105::SMR000081427::cid_2064335::ethyl 2-[2-[[5-[(2-azanyl-1,3-thiazol-4-yl)methyl]-4-methyl-1,2,4-triazol-3-yl]sulfanyl]ethanoylamino]-4,5-dimethyl-thiophene-3-carboxylate::ethyl 2-[[2-[[5-[(2-amino-1,3-thiazol-4-yl)methyl]-4-methyl-1,2,4-triazol-3-yl]sulfanyl]acetyl]amino]-4,5-dimethylthiophene-3-carboxylate::ethyl 2-{[({5-[(2-amino-1,3-thiazol-4-yl)methyl]-4-methyl-4H-1,2,4-triazol-3-yl}thio)acetyl]amino}-4,5-dimethyl-3-thiophenecarboxylate
SMILES CCOC(=O)c1c(C)c(C)sc1NC(=O)CSc1nnc(Cc2csc(N)n2)n1C
InChI Key InChIKey=PAFIEJOKAGSTPH-UHFFFAOYSA-N
Data  2 EC50
  Tab Delimited (TSV)   2D SDfile   Computed 3D by Vconf -m prep SDfile
Find this compound or compounds like it in BindingDB:
Activity Spreadsheet -- Enzyme Inhibition Constant Data from BindingDB
Found 2 hits for monomerid = 48958
TargetD(1A) dopamine receptor(Homo sapiens (Human))
Vanderbilt Screening Center For Gpcrs, Ion Channels And Transporters
Curated by PubChem BioAssay
LigandPNGBDBM48958(2-[[2-[[5-[(2-amino-4-thiazolyl)methyl]-4-methyl-1...)
Affinity DataEC50:  0.0210nM. Assay description: Assay Provider: Val Watts Assay Provider Affiliation: Purdue University Grant Title: Allosteric Modulators of D1 Receptors Grant Number: 1 X01 MH0776...
In DepthDetails PCBioAssay
TargetD(1B) dopamine receptor(Homo sapiens (Human))
Vanderbilt Screening Center For Gpcrs, Ion Channels And Transporters
Curated by PubChem BioAssay
LigandPNGBDBM48958(2-[[2-[[5-[(2-amino-4-thiazolyl)methyl]-4-methyl-1...)
Affinity DataEC50:  0.00367nM. Assay description: Assay Provider: Val Watts Assay Provider Affiliation: Purdue University Grant Title: Allosteric Modulators of D1 Receptors Grant Number: 1 X01 MH0776...
In DepthDetails PCBioAssay