BDBM48969 MLS000115755::SMR000092778::[3-amino-4-(methoxymethyl)-6-methyl-2-thieno[2,3-b]pyridinyl]-(4-phenyl-1-piperazinyl)methanone::[3-amino-4-(methoxymethyl)-6-methyl-thieno[2,3-b]pyridin-2-yl]-(4-phenylpiperazino)methanone::[3-amino-4-(methoxymethyl)-6-methylthieno[2,3-b]pyridin-2-yl]-(4-phenylpiperazin-1-yl)methanone::[3-azanyl-4-(methoxymethyl)-6-methyl-thieno[2,3-b]pyridin-2-yl]-(4-phenylpiperazin-1-yl)methanone::cid_1093414
SMILES COCc1cc(C)nc2sc(C(=O)N3CCN(CC3)c3ccccc3)c(N)c12
InChI Key InChIKey=ZEAZJNKPMRTFQD-UHFFFAOYSA-N
Data  2 EC50
  Tab Delimited (TSV)   2D SDfile   Computed 3D by Vconf -m prep SDfile
Find this compound or compounds like it in BindingDB:
Activity Spreadsheet -- Enzyme Inhibition Constant Data from BindingDB
Found 2 hits for monomerid = 48969
TargetD(1A) dopamine receptor(Homo sapiens (Human))
Vanderbilt Screening Center For Gpcrs, Ion Channels And Transporters
Curated by PubChem BioAssay
LigandPNGBDBM48969(MLS000115755 | SMR000092778 | [3-amino-4-(methoxym...)
Affinity DataEC50:  0.0163nM. Assay description: Assay Provider: Val Watts Assay Provider Affiliation: Purdue University Grant Title: Allosteric Modulators of D1 Receptors Grant Number: 1 X01 MH0776...
In DepthDetails PCBioAssay
TargetD(1B) dopamine receptor(Homo sapiens (Human))
Vanderbilt Screening Center For Gpcrs, Ion Channels And Transporters
Curated by PubChem BioAssay
LigandPNGBDBM48969(MLS000115755 | SMR000092778 | [3-amino-4-(methoxym...)
Affinity DataEC50:  0.000212nM. Assay description: Assay Provider: Val Watts Assay Provider Affiliation: Purdue University Grant Title: Allosteric Modulators of D1 Receptors Grant Number: 1 X01 MH0776...
In DepthDetails PCBioAssay