BDBM49197 6-[(4-chlorophenyl)sulfanylmethyl]-3-methyl-imidazo[2,1-b][1,3]thiazole::6-[(4-chlorophenyl)sulfanylmethyl]-3-methylimidazo[2,1-b][1,3]thiazole::6-[[(4-chlorophenyl)thio]methyl]-3-methyl-imidazo[2,1-b]thiazole::6-[[(4-chlorophenyl)thio]methyl]-3-methylimidazo[2,1-b]thiazole::MLS000068784::SMR000034119::cid_658793
SMILES Cc1csc2nc(CSc3ccc(Cl)cc3)cn12
InChI Key InChIKey=CTVPMMWYTLEMAW-UHFFFAOYSA-N
Data  1 IC50  1 EC50
  Tab Delimited (TSV)   2D SDfile   Computed 3D by Vconf -m prep SDfile
Find this compound or compounds like it in BindingDB:
Activity Spreadsheet -- Enzyme Inhibition Constant Data from BindingDB
Found 2 hits for monomerid = 49197
TargetPotassium voltage-gated channel subfamily KQT member 2(Rattus norvegicus)
Johns Hopkins Ion Channel Center
Curated by PubChem BioAssay
LigandPNGBDBM49197(6-[(4-chlorophenyl)sulfanylmethyl]-3-methyl-imidaz...)
Affinity DataIC50:  4.20E+3nM. Assay description: Source (MLPCN Center Name): Johns Hopkins Ion Channel Center (JHICC_KCNQ2_Inh_HFCP_IWS_CRC) Center Affiliation: Johns Hopkins University, School of M...
In DepthDetails PCBioAssay
TargetTranscription factor p65(Homo sapiens (Human))
Srmlsc
Curated by PubChem BioAssay
LigandPNGBDBM49197(6-[(4-chlorophenyl)sulfanylmethyl]-3-methyl-imidaz...)
Affinity DataEC50:  9.35E+4nM. Assay description: Southern Research Molecular Libraries Screening Center (SRMLSC) Southern Research Institute (Birmingham, Alabama) NIH Molecular Libraries Screening C...
In DepthDetails PCBioAssay