BDBM49220 4-methoxybenzoic acid [5-chloro-7-(4-morpholinylmethyl)-8-quinolinyl] ester::4-methoxybenzoic acid [5-chloro-7-(morpholinomethyl)-8-quinolyl] ester::MLS000082013::SMR000061351::[5-chloranyl-7-(morpholin-4-ylmethyl)quinolin-8-yl] 4-methoxybenzoate::[5-chloro-7-(morpholin-4-ylmethyl)quinolin-8-yl] 4-methoxybenzoate::cid_1534922
SMILES COc1ccc(cc1)C(=O)Oc1c(CN2CCOCC2)cc(Cl)c2cccnc12
InChI Key InChIKey=LNJZVVFIXWMTGB-UHFFFAOYSA-N
Data  3 EC50
  Tab Delimited (TSV)   2D SDfile   Computed 3D by Vconf -m prep SDfile
Find this compound or compounds like it in BindingDB:
Activity Spreadsheet -- Enzyme Inhibition Constant Data from BindingDB
Found 3 hits for monomerid = 49220
TargetTranscription factor p65(Homo sapiens (Human))
Srmlsc
Curated by PubChem BioAssay
LigandPNGBDBM49220(4-methoxybenzoic acid [5-chloro-7-(4-morpholinylme...)
Affinity DataEC50:  4.65E+4nM. Assay description: Southern Research Molecular Libraries Screening Center (SRMLSC) Southern Research Institute (Birmingham, Alabama) NIH Molecular Libraries Screening C...
In DepthDetails PCBioAssay
TargetImportin subunit alpha-1(Homo sapiens (Human))
Broad Institute
Curated by PubChem BioAssay
LigandPNGBDBM49220(4-methoxybenzoic acid [5-chloro-7-(4-morpholinylme...)
Affinity DataEC50: >5.00E+5nM. Assay description: Keywords: Counterscreen, FRET assay, HTS, YIC probe, Dose response, Assay Overview: This is a fluorescence resonance energy transfer (FRET)-based b...
In DepthDetails PCBioAssay
TargetATP-dependent molecular chaperone HSP82(Candida albicans)
Broad Institute
Curated by PubChem BioAssay
LigandPNGBDBM49220(4-methoxybenzoic acid [5-chloro-7-(4-morpholinylme...)
Affinity DataEC50:  9.17E+3nM. Assay description: Broad Institute: Reversing Antifungal Drug Resistance Project ID: 2037 Keywords: Candida albicans, drug resistance, Fluconazole, Hsp90, Calcineurin, ...
In DepthDetails PCBioAssay