BDBM49289 MLS000065698::N-(2-thiazolin-2-yl)benzothiophene-3-carboxamide::N-(4,5-dihydro-1,3-thiazol-2-yl)-1-benzothiophene-3-carboxamide::N-(4,5-dihydrothiazol-2-yl)-1-benzothiophene-3-carboxamide::SMR000080356::cid_1245402
SMILES O=C(NC1=NCCS1)c1csc2ccccc12
InChI Key InChIKey=YNYITLNFUPVIEB-UHFFFAOYSA-N
Data  2 IC50  1 EC50
  Tab Delimited (TSV)   2D SDfile   Computed 3D by Vconf -m prep SDfile
Find this compound or compounds like it in BindingDB:
Activity Spreadsheet -- Enzyme Inhibition Constant Data from BindingDB
Found 3 hits for monomerid = 49289
TargetTranscription factor p65(Homo sapiens (Human))
Srmlsc
Curated by PubChem BioAssay
LigandPNGBDBM49289(MLS000065698 | N-(2-thiazolin-2-yl)benzothiophene-...)
Affinity DataEC50:  1.73E+4nM. Assay description: Southern Research Molecular Libraries Screening Center (SRMLSC) Southern Research Institute (Birmingham, Alabama) NIH Molecular Libraries Screening C...
In DepthDetails PCBioAssay
TargetPolyadenylate-binding protein 1(Homo sapiens (Human))
Burnham Center For Chemical Genomics
Curated by PubChem BioAssay
LigandPNGBDBM49289(MLS000065698 | N-(2-thiazolin-2-yl)benzothiophene-...)
Affinity DataIC50: >6.60E+4nM. Assay description: Data Source: Sanford-Burnham Center for Chemical Genomics (SBCCG) Source Affiliation: Sanford-Burnham Medical Research Institute (SBMRI, San Diego, C...
In DepthDetails PCBioAssay
TargetPolyadenylate-binding protein 1(Homo sapiens (Human))
Burnham Center For Chemical Genomics
Curated by PubChem BioAssay
LigandPNGBDBM49289(MLS000065698 | N-(2-thiazolin-2-yl)benzothiophene-...)
Affinity DataIC50: >6.60E+4nM. Assay description: Data Source: Sanford-Burnham Center for Chemical Genomics (SBCCG) Source Affiliation: Sanford-Burnham Medical Research Institute (SBMRI, San Diego, C...
In DepthDetails PCBioAssay