BDBM49374 MLS000526707::N-(2,6-Dimethoxy-pyrimidin-4-yl)-4-methoxy-benzamide::N-(2,6-dimethoxy-4-pyrimidinyl)-4-methoxybenzamide::N-(2,6-dimethoxypyrimidin-4-yl)-4-methoxy-benzamide::N-(2,6-dimethoxypyrimidin-4-yl)-4-methoxybenzamide::SMR000117181::cid_730507
SMILES COc1ccc(cc1)C(=O)Nc1cc(OC)nc(OC)n1
InChI Key InChIKey=SIYQHQJJYPAQMH-UHFFFAOYSA-N
Data  1 EC50
  Tab Delimited (TSV)   2D SDfile   Computed 3D by Vconf -m prep SDfile
Find this compound or compounds like it in BindingDB:
Activity Spreadsheet -- Enzyme Inhibition Constant Data from BindingDB
Found 1 hit for monomerid = 49374
TargetTranscription factor p65(Homo sapiens (Human))
Srmlsc
Curated by PubChem BioAssay
LigandPNGBDBM49374(MLS000526707 | N-(2,6-Dimethoxy-pyrimidin-4-yl)-4-...)
Affinity DataEC50:  1.20E+4nM. Assay description: Southern Research Molecular Libraries Screening Center (SRMLSC) Southern Research Institute (Birmingham, Alabama) NIH Molecular Libraries Screening C...
In DepthDetails PCBioAssay