BDBM4943 (2R,3R,4S)-4-amino-2-[butyl(propyl)carbamoyl]-3-acetamido-3,4-dihydro-2H-pyran-6-carboxylic acid::carboxamide deriv. 4n
SMILES [H][C@]1(OC(=C[C@H](N)[C@H]1NC(C)=O)C(O)=O)C(=O)N(CCC)CCCC
InChI Key InChIKey=FIZVYICXTDGLOE-IACUBPJLSA-N
Data  4 IC50
  Tab Delimited (TSV)   2D SDfile   Computed 3D by Vconf -m prep SDfile
Find this compound or compounds like it in BindingDB:
Activity Spreadsheet -- Enzyme Inhibition Constant Data from BindingDB
Found 4 hits for monomerid = 4943
TargetNeuraminidase(Influenza A virus (A/Singapore/1/57(H2N2)))
Glaxo Wellcome Research And Development
LigandPNGBDBM4943((2R,3R,4S)-4-amino-2-[butyl(propyl)carbamoyl]-3-ac...)
Affinity DataIC50:  4nM. Assay description: A standard fluorimetric assay was used to measure influenza virus neuraminidase activity. The substrate 2 -(4-methylumbelliferyl)-alpha-D-acetylneura...
In DepthDetails ArticlePubMed
TargetNeuraminidase(Influenza A virus (A/Puerto Rico/8/34/Mount Sinai(...)
TBA
Curated by ChEMBL
LigandPNGBDBM4943((2R,3R,4S)-4-amino-2-[butyl(propyl)carbamoyl]-3-ac...)
Affinity DataIC50:  4nM. Assay description: Inhibition of influenza A sialidase (neuraminidase)
In DepthDetails Article
TargetNeuraminidase(Influenza B virus (B/Lee/40))
TBA
Curated by ChEMBL
LigandPNGBDBM4943((2R,3R,4S)-4-amino-2-[butyl(propyl)carbamoyl]-3-ac...)
Affinity DataIC50:  1.00E+3nM. Assay description: Inhibition of influenza B sialidase (neuraminidase)
In DepthDetails Article
TargetNeuraminidase(Influenza B virus)
Glaxo Wellcome Research And Development
LigandPNGBDBM4943((2R,3R,4S)-4-amino-2-[butyl(propyl)carbamoyl]-3-ac...)
Affinity DataIC50:  950nM. Assay description: A standard fluorimetric assay was used to measure influenza virus neuraminidase activity. The substrate 2 -(4-methylumbelliferyl)-alpha-D-acetylneura...
In DepthDetails ArticlePubMed