BDBM49443 (2E,6E)-2,6-bis[(1-methyl-2-pyrrolyl)methylidene]-1-cyclohexanone::(2E,6E)-2,6-bis[(1-methylpyrrol-2-yl)methylene]cyclohexanone::(2E,6E)-2,6-bis[(1-methylpyrrol-2-yl)methylidene]cyclohexan-1-one::MLS000519843::SMR000130261::cid_6157225
SMILES Cn1cccc1\C=C1/CCC\C(=C/c2cccn2C)C1=O
InChI Key InChIKey=VTZLPXIVTAFLQG-QUMQEAAQSA-N
Data  2 IC50  3 EC50
  Tab Delimited (TSV)   2D SDfile   Computed 3D by Vconf -m prep SDfile
Find this compound or compounds like it in BindingDB:
Activity Spreadsheet -- Enzyme Inhibition Constant Data from BindingDB
Found 5 hits for monomerid = 49443
TargetTranscription factor p65(Homo sapiens (Human))
Srmlsc
Curated by PubChem BioAssay
LigandPNGBDBM49443((2E,6E)-2,6-bis[(1-methyl-2-pyrrolyl)methylidene]-...)
Affinity DataEC50:  8.63E+3nM. Assay description: Southern Research Molecular Libraries Screening Center (SRMLSC) Southern Research Institute (Birmingham, Alabama) NIH Molecular Libraries Screening C...
In DepthDetails PCBioAssay
TargetEndoribonuclease toxin MazF(Escherichia coli str. K-12 substr. MG1655)
Burnham Center For Chemical Genomics
Curated by PubChem BioAssay
LigandPNGBDBM49443((2E,6E)-2,6-bis[(1-methyl-2-pyrrolyl)methylidene]-...)
Affinity DataEC50: >9.90E+4nM. Assay description: Data Source: Sanford-Burnham Center for Chemical Genomics (SBCCG) Source Affiliation: Sanford-Burnham Medical Research Institute (SBMRI, San Diego, C...
In DepthDetails PCBioAssay
TargetBeta-lactamase(Pseudomonas aeruginosa)
The Scripps Research Institute Molecular Screening Center
Curated by PubChem BioAssay
LigandPNGBDBM49443((2E,6E)-2,6-bis[(1-methyl-2-pyrrolyl)methylidene]-...)
Affinity DataIC50:  1.09E+4nM. Assay description: Source (MLPCN Center Name): The Scripps Research Institute Molecular Screening Center (SRIMSC) Affiliation: The Scripps Research Institute, TSRI Assa...
In DepthDetails PCBioAssay
TargetToll-like receptor 9(Homo sapiens (Human))
The Scripps Research Institute Molecular Screening Center
Curated by PubChem BioAssay
LigandPNGBDBM49443((2E,6E)-2,6-bis[(1-methyl-2-pyrrolyl)methylidene]-...)
Affinity DataIC50:  1.22E+4nM. Assay description: Source (MLPCN Center Name): The Scripps Research Institute Molecular Screening Center (SRIMSC) Affiliation: The Scripps Research Institute, TSRI Assa...
In DepthDetails PCBioAssay
TargetEndoribonuclease toxin MazF(Escherichia coli str. K-12 substr. MG1655)
Burnham Center For Chemical Genomics
Curated by PubChem BioAssay
LigandPNGBDBM49443((2E,6E)-2,6-bis[(1-methyl-2-pyrrolyl)methylidene]-...)
Affinity DataEC50:  2.39E+4nM. Assay description: Data Source: Sanford-Burnham Center for Chemical Genomics (SBCCG) Source Affiliation: Sanford-Burnham Medical Research Institute (SBMRI, San Diego, C...
In DepthDetails PCBioAssay